Target
Prostaglandin E2 receptor EP4 subtype
Ligand
BDBM154981
Substrate
Meas. Tech.
In Vitro Binding Assay
pH
7.4±n/a
Ki
0.45±n/a nM
Comments
extracted
Citation
 Manninen, PRWarshawsky, AM Phenoxyethoxy compounds US Patent  US9000043 Publication Date 4/7/2015 
Target
Name:
Prostaglandin E2 receptor EP4 subtype
Synonyms:
PE2R4_HUMAN PGE2 receptor EP4 subtype PTGER4 Prostanoid EP4 receptor
Type:
Enzyme
Mol. Mass.:
53134.53
Organism:
Homo sapiens (Human)
Description:
P35408
Residue:
488
  
Inhibitor
Name:
BDBM154981
Synonyms:
US9000043, 1
Type:
Small organic molecule
Emp. Form.:
C22H27NO5
Mol. Mass.:
385.4535
SMILES:
CC(C)[C@@H](OCCOc1ccccc1)C(=O)N[C@@H](C)c1ccc(cc1)C(O)=O
: