Target
Beta-secretase 1
Ligand
BDBM155111
Substrate
Meas. Tech.
TR-FRET Assay
pH
2.5±n/a
IC50
89±n/a nM
Comments
extracted
Citation
 Karlstrom, SCsjernyik, GSwahn, BSandberg, LKolmodin, KSoderman, POhberg, L 2H-imidazol-4-amine compounds and their use as BACE inhibitors US Patent  US9000182 Publication Date 4/7/2015 
Target
Name:
Beta-secretase 1
Synonyms:
ASP2 Aspartyl protease 2 BACE1 Beta-secretase (BACE) Beta-secretase 1 (BACE 1) Beta-secretase 1 (BACE1) Beta-site amyloid precursor protein cleaving enzyme 1 Memapsin-2 beta-Secretase (BACE-1) | beta-Secretase (BACE1)
Type:
Protein
Mol. Mass.:
55755.10
Organism:
Homo sapiens (Human)
Description:
P56817
Residue:
501
  
Inhibitor
Name:
BDBM155111
Synonyms:
US9000182, 18
Type:
Small organic molecule
Emp. Form.:
C22H31N3O2
Mol. Mass.:
369.5004
SMILES:
CC[C@@H](C)Oc1ccc2C[C@@]3(CC[C@@H](CC3)OC)C3(N=C(C)C(N)=N3)c2c1
: