Target
Beta-secretase 1
Ligand
BDBM155114
Substrate
Meas. Tech.
TR-FRET Assay
pH
2.5±n/a
IC50
6530±n/a nM
Comments
extracted
Citation
 Karlstrom, SCsjernyik, GSwahn, BSandberg, LKolmodin, KSoderman, POhberg, L 2H-imidazol-4-amine compounds and their use as BACE inhibitors US Patent  US9000182 Publication Date 4/7/2015 
Target
Name:
Beta-secretase 1
Synonyms:
ASP2 Aspartyl protease 2 BACE1 Beta-secretase (BACE) Beta-secretase 1 (BACE 1) Beta-secretase 1 (BACE1) Beta-site amyloid precursor protein cleaving enzyme 1 Memapsin-2 beta-Secretase (BACE-1) | beta-Secretase (BACE1)
Type:
Protein
Mol. Mass.:
55755.10
Organism:
Homo sapiens (Human)
Description:
P56817
Residue:
501
  
Inhibitor
Name:
BDBM155114
Synonyms:
US9000182, 21, isomer 2
Type:
Small organic molecule
Emp. Form.:
C25H26N4O
Mol. Mass.:
398.5001
SMILES:
CC#Cc1cncc(c1)-c1ccc2C[C@@]3(CC[C@H](O)CC3)[C@@]3(N=C(C)C(N)=N3)c2c1
: