Target
Amyloid-beta precursor protein
Ligand
BDBM155111
Substrate
Meas. Tech.
Release Assay
Temperature
310.15±n/a K
IC50
16±n/a nM
Comments
extracted
Citation
 Karlstrom, SCsjernyik, GSwahn, BSandberg, LKolmodin, KSoderman, POhberg, L 2H-imidazol-4-amine compounds and their use as BACE inhibitors US Patent  US9000182 Publication Date 4/7/2015 
Target
Name:
Amyloid-beta precursor protein
Synonyms:
A4 ABPP AICD-50 AICD-59 AID(57) APP Alzheimer disease amyloid protein Amyloid beta Protein Amyloid beta protein Abeta(1-42) Amyloid intracellular domain 57 Amyloid protein (Abeta42b) Beta amyloid A4 protein Beta-APP42 Beta-amyloid protein 42 C83 CVAP Gamma Secretase Gamma-CTF(57) Gamma-secretase Gamma-secretase C-terminal fragment 57 P3(40) PN-II Protease nexin-II S-APP-beta Soluble APP-beta | beta-Amyloid Precursor Protein (APP)
Type:
Single-pass type I membrane protein
Mol. Mass.:
86890.41
Organism:
Homo sapiens (Human)
Description:
P05067
Residue:
770
  
Inhibitor
Name:
BDBM155111
Synonyms:
US9000182, 18
Type:
Small organic molecule
Emp. Form.:
C22H31N3O2
Mol. Mass.:
369.5004
SMILES:
CC[C@@H](C)Oc1ccc2C[C@@]3(CC[C@@H](CC3)OC)C3(N=C(C)C(N)=N3)c2c1
: