Target
Oxysterols receptor LXR-alpha
Ligand
BDBM155259
Substrate
Meas. Tech.
Radioligand Binding Assay
Ki
398±n/a nM
Citation
 Dong, CFan, YLeftheris, KLotesta, SDSingh, SBTice, CMZhao, WZheng, YZhuang, L Liver X receptor modulators US Patent  US9006244 Publication Date 4/14/2015 
Target
Name:
Oxysterols receptor LXR-alpha
Synonyms:
LXRA Liver X receptor alpha Liver X receptor alpha (NR1H3) NR1H3 Nuclear orphan receptor LXR-alpha | Nuclear receptor subfamily 1 group H member 3
Type:
Enzyme Catalytic Domain
Mol. Mass.:
50403.85
Organism:
Homo sapiens (Human)
Description:
Q13133
Residue:
447
  
Inhibitor
Name:
BDBM155259
Synonyms:
US9006244, E3a | US9814715, Example 3, isomer 1
Type:
Small organic molecule
Emp. Form.:
C20H21F3N4O2S
Mol. Mass.:
438.467
SMILES:
CC(C)[C@H]1N(CCn2c1cc1ccc(cc21)S(C)(=O)=O)c1nccc(n1)C(F)(F)F
: