Target
Dihydroorotate dehydrogenase (quinone), mitochondrial
Ligand
BDBM155440
Substrate
Meas. Tech.
Enzyme Assay
pH
8±n/a
IC50
5.6±n/a nM
Comments
extracted
Citation
 Thunuguntla, SSSubramanya, HKunnam, SRSanivaru Vijay, SRBingi, CKusanur, RSchwarz, MArlt, M Dihydroorotate dehydrogenase inhibitors US Patent  US9006454 Publication Date 4/14/2015 
Target
Name:
Dihydroorotate dehydrogenase (quinone), mitochondrial
Synonyms:
DHODH Dihydroorotate dehydrogenase Dihydroorotate dehydrogenase, mitochondrial Dihydroorotate oxidase (DHODH) | PYRD_HUMAN
Type:
Enzyme
Mol. Mass.:
42881.33
Organism:
Homo sapiens (Human)
Description:
Q02127
Residue:
395
  
Inhibitor
Name:
BDBM155440
Synonyms:
US9006454, I82
Type:
Small organic molecule
Emp. Form.:
C21H15F4N3O2
Mol. Mass.:
417.3563
SMILES:
Cc1ccc(C)n1-c1c(F)c(F)c(-c2nc3cc(C)cc(C(O)=O)c3[nH]2)c(F)c1F
: