Target
Dihydroorotate dehydrogenase (quinone), mitochondrial
Ligand
BDBM155489
Substrate
Meas. Tech.
Enzyme Assay
pH
8±n/a
IC50
18±n/a nM
Comments
extracted
Citation
 Thunuguntla, SSSubramanya, HKunnam, SRSanivaru Vijay, SRBingi, CKusanur, RSchwarz, MArlt, M Dihydroorotate dehydrogenase inhibitors US Patent  US9006454 Publication Date 4/14/2015 
Target
Name:
Dihydroorotate dehydrogenase (quinone), mitochondrial
Synonyms:
DHODH Dihydroorotate dehydrogenase Dihydroorotate dehydrogenase, mitochondrial Dihydroorotate oxidase (DHODH) | PYRD_HUMAN
Type:
Enzyme
Mol. Mass.:
42881.33
Organism:
Homo sapiens (Human)
Description:
Q02127
Residue:
395
  
Inhibitor
Name:
BDBM155489
Synonyms:
US9006454, I131
Type:
Small organic molecule
Emp. Form.:
C20H9F5N2O2
Mol. Mass.:
404.2897
SMILES:
OC(=O)c1cccc2[nH]c(nc12)-c1c(F)c(F)c(c(F)c1F)-c1ccccc1F
: