Target
ATP-sensitive inward rectifier potassium channel 1
Ligand
BDBM155928
Substrate
Meas. Tech.
Electrophysiology Assay
pH
7.4±n/a
IC50
36±n/a nM
Comments
extracted
Citation
 Pasternak, AZhu, YShahripour, ATang, HYang, LWalsh, SPTeumelsan, NH Inhibitors of the renal outer medullary potassium channel US Patent  US9018211 Publication Date 4/28/2015 
Target
Name:
ATP-sensitive inward rectifier potassium channel 1
Synonyms:
ATP-regulated potassium channel ROM-K Inward rectifier K(+) channel Kir1.1 KCNJ1_RAT Potassium channel (ATP modulatory) Renal Outer Medullary Potassium (ROMK) Romk1 | The Renal Outer Medullary Potassium (ROMK) channel (Kir1.1)
Type:
Enzyme
Mol. Mass.:
44976.27
Organism:
Rattus norvegicus (Rat)
Description:
P35560
Residue:
391
  
Inhibitor
Name:
BDBM155928
Synonyms:
US9018211, 52
Type:
Small organic molecule
Emp. Form.:
C24H28N4O5
Mol. Mass.:
452.5029
SMILES:
COc1cc(ncc1C#N)[C@@H](O)CN1CCN(C[C@H](O)c2ccc3C(=O)OCc3c2C)CC1
: