Target
Mitogen-activated protein kinase 1
Ligand
BDBM157515
Substrate
Meas. Tech.
IMAP-FP Assay
IC50
129.8±n/a nM
Citation
 Lim, JKelley, EHMethot, JLZhou, HPetrocchi, AMansoor, UFFischer, CO'Boyle, BGuerin, DJBienstock, CEBoyce, CWDaniels, MHFalcone, DFerguson, RDFevrier, SHuang, XLipford, KASloman, DLWilson, KZhou, WWitter, DMaletic, MMSiliphaivanh, P Compounds that are ERK inhibitors US Patent  US9023865 Publication Date 5/5/2015 
Target
Name:
Mitogen-activated protein kinase 1
Synonyms:
ERK2 Extracellular signal-regulated kinase 2 Extracellular signal-regulated kinase 2 (ERK2) MAPK 2 MK01_HUMAN Mitogen-activated protein kinase 1 (ERK-2) Mitogen-activated protein kinase 2 PRKM2 | p42-MAPK
Type:
Ser/Thr Protein Kinase
Mol. Mass.:
41392.76
Organism:
Homo sapiens (Human)
Description:
P28482
Residue:
360
  
Inhibitor
Name:
BDBM157515
Synonyms:
US9023865, 356
Type:
Small organic molecule
Emp. Form.:
C21H19N7O
Mol. Mass.:
385.4219
SMILES:
Cc1cc(ccn1)-c1n[nH]c2cc(NC(=O)NC3(CC3)c3ccncc3)ncc12
: