Target
Trace amine-associated receptor 1
Ligand
BDBM158226
Substrate
Meas. Tech.
Radioligand Binding Assay
pH
7.4±n/a
Temperature
310.15±n/a K
Ki
5±n/a nM
Comments
extracted
Citation
 Galley, GNorcross, RPflieger, P Substituted benzamide derivatives US Patent  US9029370 Publication Date 5/12/2015 
Target
Name:
Trace amine-associated receptor 1
Synonyms:
TAAR1_RAT Taar1 Trace amine receptor 1 (TARR1) Trace amine-associated receptor 1 (TAAR1) Trar1
Type:
Enzyme
Mol. Mass.:
38034.73
Organism:
Rattus norvegicus (Rat)
Description:
Q923Y9
Residue:
332
  
Inhibitor
Name:
BDBM158226
Synonyms:
US9029370, 20
Type:
Small organic molecule
Emp. Form.:
C16H16Cl2N4O2
Mol. Mass.:
367.23
SMILES:
Clc1ccc(NC(=O)Nc2ccc(cc2Cl)[C@@H]2CNCCO2)cn1
: