Target
Bifunctional epoxide hydrolase 2
Ligand
BDBM158487
Substrate
Meas. Tech.
sEH Assay
IC50
0.5±n/a nM
Citation
 Hammock, BDHwang, SHWecksler, ATMorisseau, C Sorafenib derivatives as sEH inhibitors US Patent  US9029401 Publication Date 5/12/2015 
Target
Name:
Bifunctional epoxide hydrolase 2
Synonyms:
Cytosolic epoxide hydrolase 2 EPHX2 HYES_HUMAN Soluble epoxide hydrolase (sEH) | epoxide hydrolase 2, cytoplasmic
Type:
Enzyme
Mol. Mass.:
62613.07
Organism:
Homo sapiens (Human)
Description:
P34913
Residue:
555
  
Inhibitor
Name:
BDBM158487
Synonyms:
US10383835, Compound 2226 | US9029401, 2253
Type:
Small organic molecule
Emp. Form.:
C22H23ClF3N3O3
Mol. Mass.:
469.885
SMILES:
CNC(=O)c1ccc(O[C@H]2CCC(CC2)NC(=O)Nc2ccc(Cl)c(c2)C(F)(F)F)cc1
: