Target
Mitogen-activated protein kinase kinase kinase 14
Ligand
BDBM158864
Substrate
Meas. Tech.
Inhibition Assay
pH
7.2±n/a
Ki
7±n/a nM
Comments
extracted
Citation
 Staben, SCastanedo, GMontalbetti, CAFeng, J Tricyclic compounds and methods of use therefor US Patent  US9034866 Publication Date 5/19/2015 
Target
Name:
Mitogen-activated protein kinase kinase kinase 14
Synonyms:
HsNIK MAP3K14 NF-kappa-beta-inducing kinase (NF-kB) Serine/threonine-protein kinase NIK
Type:
Protein
Mol. Mass.:
104059.50
Organism:
Homo sapiens (Human)
Description:
Q99558
Residue:
947
  
Inhibitor
Name:
BDBM158864
Synonyms:
US9034866, 339
Type:
Small organic molecule
Emp. Form.:
C22H22FN3O4
Mol. Mass.:
411.4262
SMILES:
CC(C)(O)C#Cc1cc2-c3nc(C(N)=O)c(n3C3CC(C3)c2cc1F)C1(O)COC1
: