Target
[Pyruvate dehydrogenase (acetyl-transferring)] kinase isozyme 1, mitochondrial
Ligand
BDBM160544
Substrate
Meas. Tech.
Inhbition Assay
pH
8±n/a
IC50
3.5±n/a nM
Comments
extracted
Citation
 Motomura, TShomi, G Pyrazole-amide compounds and pharmaceutical use thereof US Patent  US9040717 Publication Date 5/26/2015 
Target
Name:
[Pyruvate dehydrogenase (acetyl-transferring)] kinase isozyme 1, mitochondrial
Synonyms:
PDHK1 PDK1_HUMAN Pyruvate dehydrogenase kinase 1 (PDK1) | Pyruvate dehydrogenase kinase isoform 1
Type:
Protein
Mol. Mass.:
49255.23
Organism:
Homo sapiens (Human)
Description:
Q15118
Residue:
436
  
Inhibitor
Name:
BDBM160544
Synonyms:
US9040717, Compound (3)
Type:
Small organic molecule
Emp. Form.:
C27H30F3N3O4
Mol. Mass.:
517.54
SMILES:
CC(C)(O)CCCOc1cc2c(-c3ccccc3[C@]2(O)C(F)(F)F)c(c1)-c1cnn(c1)C(C)(C)C(N)=O
: