Target
[Pyruvate dehydrogenase (acetyl-transferring)] kinase isozyme 2, mitochondrial
Ligand
BDBM160539
Substrate
Meas. Tech.
Inhbition Assay
pH
8±n/a
Temperature
303.15±n/a K
IC50
7.4±n/a nM
Comments
extracted
Citation
 Motomura, TShomi, G Pyrazole-amide compounds and pharmaceutical use thereof US Patent  US9040717 Publication Date 5/26/2015 
Target
Name:
[Pyruvate dehydrogenase (acetyl-transferring)] kinase isozyme 2, mitochondrial
Synonyms:
PDHK2 PDK2_HUMAN Pyruvate dehydrogenase kinase isoenzyme 1 (PDK2)
Type:
Enzyme
Mol. Mass.:
46153.78
Organism:
Homo sapiens (Human)
Description:
Q15119
Residue:
407
  
Inhibitor
Name:
BDBM160539
Synonyms:
US9040717, Compound (B)
Type:
Small organic molecule
Emp. Form.:
C22H21F3N2O3
Mol. Mass.:
418.4089
SMILES:
Cn1cc(cn1)-c1cc(OCC(C)(C)O)cc2c1-c1ccccc1[C@]2(O)C(F)(F)F
: