Target
[Pyruvate dehydrogenase (acetyl-transferring)] kinase isozyme 2, mitochondrial
Ligand
BDBM160540
Substrate
Meas. Tech.
Inhbition Assay
pH
8±n/a
Temperature
303.15±n/a K
IC50
6.7±n/a nM
Comments
extracted
Citation
 Motomura, TShomi, G Pyrazole-amide compounds and pharmaceutical use thereof US Patent  US9040717 Publication Date 5/26/2015 
Target
Name:
[Pyruvate dehydrogenase (acetyl-transferring)] kinase isozyme 2, mitochondrial
Synonyms:
PDHK2 PDK2_HUMAN Pyruvate dehydrogenase kinase isoenzyme 1 (PDK2)
Type:
Enzyme
Mol. Mass.:
46153.78
Organism:
Homo sapiens (Human)
Description:
Q15119
Residue:
407
  
Inhibitor
Name:
BDBM160540
Synonyms:
US9040717, Compound (C)
Type:
Small organic molecule
Emp. Form.:
C23H23F3N2O4
Mol. Mass.:
448.4349
SMILES:
CC(C)(O)COc1cc2c(-c3ccccc3[C@]2(O)C(F)(F)F)c(c1)-c1cnn(CCO)c1
: