Target
Sodium-dependent serotonin transporter
Ligand
BDBM160602
Substrate
Meas. Tech.
Radioligand Binding Assay
pH
7.5±n/a
Temperature
277.15±n/a K
IC50
7.3±n/a nM
Comments
extracted
Citation
 Guzzo, PRLiu, SRyan, KNMolino, BFDeOrazio, ROlson, REMacor, JE 2,5-methano- and 2,5-ethano-tetrahydrobenzazepine derivatives and use thereof to block reuptake of norepinephrine, dopamine, and serotonin US Patent  US9045468 Publication Date 6/2/2015 
Target
Name:
Sodium-dependent serotonin transporter
Synonyms:
5-HT Transporter 5HTT SC6A4_HUMAN SLC6A4 Serotonin transporter (5HTT) Sodium-dependent serotonin transporter (SERT) | Solute carrier family 6 member 4
Type:
Multi-pass membrane protein
Mol. Mass.:
70322.51
Organism:
Homo sapiens (Human)
Description:
P31645
Residue:
630
  
Inhibitor
Name:
BDBM160602
Synonyms:
US9045468, 16
Type:
Small organic molecule
Emp. Form.:
C22H20ClN3
Mol. Mass.:
361.867
SMILES:
Clc1ccc(cc1)C12CCN(CC1)Cc1cc(ccc21)-c1cncnc1
: