Target
Cytochrome P450 11B2, mitochondrial
Ligand
BDBM287684
Substrate
Meas. Tech.
Metalloenzyme Activity
IC50
<100±n/a nM
Citation
 Sparks, SYates, CMShaver, SRHoekstra, WJ Metalloenzyme inhibitor compounds US Patent  US10085984 Publication Date 10/2/2018 
Target
Name:
Cytochrome P450 11B2, mitochondrial
Synonyms:
Aldosterone Synthase (CYP11B2) Aldosterone-synthesizing enzyme CYP11B2 Cytochrome P450 11B2 Cytochrome P450 11B2, mitochondrial P-450C18 | Steroid 18-hydroxylase
Type:
Protein
Mol. Mass.:
57582.15
Organism:
Homo sapiens (Human)
Description:
P19099
Residue:
503
  
Inhibitor
Name:
BDBM287684
Synonyms:
US10085984, Example 62 | US11040034, Ex. No. 62
Type:
Small organic molecule
Emp. Form.:
C20H12F4N4
Mol. Mass.:
384.3297
SMILES:
Fc1ccc(c(F)c1)-c1cc(cnn1)-c1nc2cc(F)c(F)cc2n1C1CC1
: