Target
SUMO-activating enzyme subunit 1/2
Ligand
BDBM54915
Substrate
Meas. Tech.
Biochemical Assay
IC50
500±n/a nM
Citation
 Chen, YLi, YDivlianska, DBobkova, ERoth, GPu, JKhan, P Inhibition of small ubiquitin-like modifier enzymes with substituted pyrrolo[2,3-b]quinoxalines US Patent  US9045483 Publication Date 6/2/2015 
Target
Name:
SUMO-activating enzyme subunit 1/2
Synonyms:
SUMO E1 | SUMO-activating enzyme
Type:
Mol. Mass.:
Description:
ASSAY_ID of ChEMBL is 977623
Components:
This complex has 2 components.
Component 1
Name:
SUMO-activating enzyme subunit 2
Synonyms:
6.3.2.- SAE2 SUMO-activating enzyme subunit 2 UBA2 Ubiquitin-like 1-activating enzyme E1B | Ubiquitin-like modifier-activating enzyme 2
Type:
Enzyme
Mol. Mass.:
71206.17
Organism:
Homo sapiens (Human)
Description:
Q9UBT2
Residue:
640
  
Component 2
Name:
SUMO-activating enzyme subunit 1
Synonyms:
AOS1 SAE1_HUMAN SUMO-activating enzyme subunit 1 (SAE1) UBLE1A
Type:
Enzyme Catalytic Domain
Mol. Mass.:
38440.84
Organism:
Homo sapiens (Human)
Description:
gi_17390638
Residue:
346
  
Inhibitor
Name:
BDBM54915
Synonyms:
MLS000588658 N-[1-Butyl-3-(toluene-4-sulfonyl)-1H-pyrrolo[2,3-b]quinoxalin-2-yl]-benzenesulfonamide N-[1-butyl-3-(4-methylphenyl)sulfonyl-pyrrolo[3,2-b]quinoxalin-2-yl]benzenesulfonamide SMR000212297 cid_1930124
Type:
Small organic molecule
Emp. Form.:
C27H26N4O4S2
Mol. Mass.:
534.65
SMILES:
CCCCn1c(NS(=O)(=O)c2ccccc2)c(c2nc3ccccc3nc12)S(=O)(=O)c1ccc(C)cc1
: