Target
SUMO-activating enzyme subunit 1/2
Ligand
BDBM30722
Substrate
Meas. Tech.
Biochemical Assay
IC50
20000±n/a nM
Citation
 Chen, YLi, YDivlianska, DBobkova, ERoth, GPu, JKhan, P Inhibition of small ubiquitin-like modifier enzymes with substituted pyrrolo[2,3-b]quinoxalines US Patent  US9045483 Publication Date 6/2/2015 
Target
Name:
SUMO-activating enzyme subunit 1/2
Synonyms:
SUMO E1 | SUMO-activating enzyme
Type:
Mol. Mass.:
Description:
ASSAY_ID of ChEMBL is 977623
Components:
This complex has 2 components.
Component 1
Name:
SUMO-activating enzyme subunit 2
Synonyms:
6.3.2.- SAE2 SUMO-activating enzyme subunit 2 UBA2 Ubiquitin-like 1-activating enzyme E1B | Ubiquitin-like modifier-activating enzyme 2
Type:
Enzyme
Mol. Mass.:
71206.17
Organism:
Homo sapiens (Human)
Description:
Q9UBT2
Residue:
640
  
Component 2
Name:
SUMO-activating enzyme subunit 1
Synonyms:
AOS1 SAE1_HUMAN SUMO-activating enzyme subunit 1 (SAE1) UBLE1A
Type:
Enzyme Catalytic Domain
Mol. Mass.:
38440.84
Organism:
Homo sapiens (Human)
Description:
gi_17390638
Residue:
346
  
Inhibitor
Name:
BDBM30722
Synonyms:
MLS000068755 N-(1-butyl-3-cyano-pyrrolo[3,2-b]quinoxalin-2-yl)-2-chloranyl-benzamide N-(1-butyl-3-cyanopyrrolo[3,2-b]quinoxalin-2-yl)-2-chlorobenzamide US9045483, 2 | cid_658797
Type:
Small organic molecule
Emp. Form.:
C22H18ClN5O
Mol. Mass.:
403.864
SMILES:
CCCCn1c(NC(=O)c2ccccc2Cl)c(C#N)c2nc3ccccc3nc12
: