Target
SUMO-activating enzyme subunit 1/2
Ligand
BDBM43094
Substrate
Meas. Tech.
Biochemical Assay
IC50
25000±n/a nM
Citation
 Chen, YLi, YDivlianska, DBobkova, ERoth, GPu, JKhan, P Inhibition of small ubiquitin-like modifier enzymes with substituted pyrrolo[2,3-b]quinoxalines US Patent  US9045483 Publication Date 6/2/2015 
Target
Name:
SUMO-activating enzyme subunit 1/2
Synonyms:
SUMO E1 | SUMO-activating enzyme
Type:
Mol. Mass.:
Description:
ASSAY_ID of ChEMBL is 977623
Components:
This complex has 2 components.
Component 1
Name:
SUMO-activating enzyme subunit 2
Synonyms:
6.3.2.- SAE2 SUMO-activating enzyme subunit 2 UBA2 Ubiquitin-like 1-activating enzyme E1B | Ubiquitin-like modifier-activating enzyme 2
Type:
Enzyme
Mol. Mass.:
71206.17
Organism:
Homo sapiens (Human)
Description:
Q9UBT2
Residue:
640
  
Component 2
Name:
SUMO-activating enzyme subunit 1
Synonyms:
AOS1 SAE1_HUMAN SUMO-activating enzyme subunit 1 (SAE1) UBLE1A
Type:
Enzyme Catalytic Domain
Mol. Mass.:
38440.84
Organism:
Homo sapiens (Human)
Description:
gi_17390638
Residue:
346
  
Inhibitor
Name:
BDBM43094
Synonyms:
2-chloranyl-N-[3-cyano-1-(phenylmethyl)pyrrolo[3,2-b]quinoxalin-2-yl]benzamide MLS000588660 N-(1-benzyl-3-cyano-pyrrolo[3,2-b]quinoxalin-2-yl)-2-chloro-benzamide SMR000212272 cid_987585
Type:
Small organic molecule
Emp. Form.:
C25H16ClN5O
Mol. Mass.:
437.88
SMILES:
Clc1ccccc1C(=O)Nc1c(C#N)c2nc3ccccc3nc2n1Cc1ccccc1
: