Target
ATP-sensitive inward rectifier potassium channel 1
Ligand
BDBM162872
Substrate
Meas. Tech.
Electrophysiology Assay
pH
7.4±n/a
IC50
20±n/a nM
Comments
extracted
Citation
 Pasternak, AdeJesus, RKZhu, YYang, LWalsh, STang, HKim, DPio, BShahripour, ABelyk, K Inhibitors of the renal outer medullary potassium channel US Patent  US9056859 Publication Date 6/16/2015 
Target
Name:
ATP-sensitive inward rectifier potassium channel 1
Synonyms:
ATP-regulated potassium channel ROM-K Inward rectifier K(+) channel Kir1.1 KCNJ1_RAT Potassium channel (ATP modulatory) Renal Outer Medullary Potassium (ROMK) Romk1 | The Renal Outer Medullary Potassium (ROMK) channel (Kir1.1)
Type:
Enzyme
Mol. Mass.:
44976.27
Organism:
Rattus norvegicus (Rat)
Description:
P35560
Residue:
391
  
Inhibitor
Name:
BDBM162872
Synonyms:
US9056859, 72
Type:
Small organic molecule
Emp. Form.:
C23H25N7O3
Mol. Mass.:
447.4897
SMILES:
Cc1c2COC(=O)c2ccc1CCN1CCN(CC1)C(=O)Cc1ccc(nc1)-n1cnnn1
: