Target
UDP-galactopyranose mutase
Ligand
BDBM163663
Substrate
Meas. Tech.
HPLC-based Assay
Temperature
295.15±0 K
Ki
2.5e+4± 8e+3 nM
Citation
 Kincaid, VALondon, NWangkanont, KWesener, DAMarcus, SAHéroux, ANedyalkova, LTalaat, AMForest, KTShoichet, BKKiessling, LL Virtual Screening for UDP-Galactopyranose Mutase Ligands Identifies a New Class of Antimycobacterial Agents. ACS Chem Biol 10:2209-18 (2015)  
Target
Name:
UDP-galactopyranose mutase
Synonyms:
UDP-galactopyranose mutase | Uridine 5'-diphosphate-galactopyranose mutase (UGM)
Type:
Protein
Mol. Mass.:
54393.81
Organism:
Caenorhabditis elegans (Roundworm)
Description:
G5ECS4
Residue:
476
  
Inhibitor
Name:
BDBM163663
Synonyms:
2‐[6‐(4‐Chlorophenyl)‐3‐(thiophen‐2‐yl)‐7H‐[1,2,4]triazolo[3,4‐b][1,3,4]thiadiazin‐7‐yl]acetate (22)
Type:
Small organic molecule
Emp. Form.:
C16H10ClN4O2S2
Mol. Mass.:
389.86
SMILES:
[O-]C(=O)CC1Sc2nnc(-c3cccs3)n2N=C1c1ccc(Cl)cc1
: