Target
Probable UDP-galactopyranose mutase
Ligand
BDBM163670
Substrate
Meas. Tech.
HPLC-based Assay
Temperature
295.15±0 K
Kd
5.9e+4± 2.7e+4 nM
Citation
 Kincaid, VALondon, NWangkanont, KWesener, DAMarcus, SAHéroux, ANedyalkova, LTalaat, AMForest, KTShoichet, BKKiessling, LL Virtual Screening for UDP-Galactopyranose Mutase Ligands Identifies a New Class of Antimycobacterial Agents. ACS Chem Biol 10:2209-18 (2015)  
Target
Name:
Probable UDP-galactopyranose mutase
Synonyms:
GLF8_KLEPN Uridine 5'-diphosphate-galactopyranose mutase (UGM) | rfbD
Type:
Protein
Mol. Mass.:
44463.54
Organism:
Klebsiella pneumoniae (Enterobacteria)
Description:
Residue:
384
  
Inhibitor
Name:
BDBM163670
Synonyms:
2‐{3‐[(4‐Fluorophenyl)methyl]‐6‐(thiophen‐2‐yl)‐7H‐[1,2,4]triazolo[3,4‐b][1,3,4]thiadiazin‐7‐yl}acetate (29)
Type:
Small organic molecule
Emp. Form.:
C17H12FN4O2S2
Mol. Mass.:
387.432
SMILES:
[O-]C(=O)CC1Sc2nnc(Cc3ccc(F)cc3)n2N=C1c1cccs1
: