Target
Probable UDP-galactopyranose mutase
Ligand
BDBM163657
Substrate
Meas. Tech.
Fluorescence Polarization Assay
Kd
4.3e+4± 2.0e+4 nM
Citation
 Kincaid, VALondon, NWangkanont, KWesener, DAMarcus, SAHéroux, ANedyalkova, LTalaat, AMForest, KTShoichet, BKKiessling, LL Virtual Screening for UDP-Galactopyranose Mutase Ligands Identifies a New Class of Antimycobacterial Agents. ACS Chem Biol 10:2209-18 (2015)  
Target
Name:
Probable UDP-galactopyranose mutase
Synonyms:
GLF8_KLEPN Uridine 5'-diphosphate-galactopyranose mutase (UGM) | rfbD
Type:
Protein
Mol. Mass.:
44463.54
Organism:
Klebsiella pneumoniae (Enterobacteria)
Description:
Residue:
384
  
Inhibitor
Name:
BDBM163657
Synonyms:
2‐[3‐(Furan‐2‐yl)‐6‐phenyl‐7H‐[1,2,4]triazolo[3,4‐b][1,3,4]thiadiazin‐7‐yl]acetate (6)
Type:
Small organic molecule
Emp. Form.:
C16H11N4O3S
Mol. Mass.:
339.349
SMILES:
[O-]C(=O)CC1Sc2nnc(-c3ccco3)n2N=C1c1ccccc1
: