Target
Lipopolysaccharide-induced tumor necrosis factor-alpha factor
Ligand
BDBM135821
Substrate
Meas. Tech.
TNF inhibition assay
IC50
29.0±n/a nM
Citation
 Mjalli, AMGaddam, BPolisetti, DRKostura, MJGuzel, M Tricyclic compounds as modulators of TNF-α synthesis and as PDE4 inhibitors US Patent  US10085990 Publication Date 10/2/2018 
Target
Name:
Lipopolysaccharide-induced tumor necrosis factor-alpha factor
Synonyms:
LITAF LPS-induced TNF-alpha factor SIMPLE TNF-alpha | p53-induced gene 7 protein
Type:
Enzyme Catalytic Domain
Mol. Mass.:
17106.57
Organism:
Homo sapiens (Human)
Description:
TNF-alpha 0 HUMAN::Q99732
Residue:
161
  
Inhibitor
Name:
BDBM135821
Synonyms:
US10085990, Example 118 US8853226, 118 US9833457, 118
Type:
Small organic molecule
Emp. Form.:
C23H21ClN4O5S
Mol. Mass.:
500.955
SMILES:
COc1cccc2c1ncc1c2n([C@H]2CCN(C2)S(C)(=O)=O)c(=O)n(-c2cccc(Cl)c2)c1=O
: