Target
High affinity nerve growth factor receptor
Ligand
BDBM164956
Substrate
Meas. Tech.
Inhibition Assay
pH
7.5±n/a
Temperature
298.15±n/a K
IC50
0.3±n/a nM
Comments
extracted
Citation
 Kane, Jr., JLMatthews, GMetz, MKothe, MLiu, JScholte, A Tropomyosin-related kinase (TRK) inhibitors US Patent  US9067914 Publication Date 6/30/2015 
Target
Name:
High affinity nerve growth factor receptor
Synonyms:
2.7.10.1 NTRK1 NTRK1_HUMAN Neurotrophic tyrosine kinase receptor type 1 Synonyms=MTC TRK1-transforming tyrosine kinase protein TRKA GN Trk-A Tropomyosin-related kinase A Tyrosine kinase receptor Tyrosine kinase receptor A Tyrosine kinase receptor A (Trk-A) gp140trk | p140-TrkA
Type:
Mol. Mass.:
87498.18
Organism:
Homo sapiens (Human)
Description:
P04629
Residue:
796
  
Inhibitor
Name:
BDBM164956
Synonyms:
US10166239, Ex. 3-49-6a US9067914, Ex. 3-49-6a
Type:
Small organic molecule
Emp. Form.:
C27H25F3N6O2
Mol. Mass.:
522.5216
SMILES:
COc1cc(ccc1OCc1ccc(cc1)C(F)(F)F)[C@H](C)n1c(N)nc2cc(cnc12)-c1cnn(C)c1
: