Target
Trace amine-associated receptor 1
Ligand
BDBM167461
Substrate
Meas. Tech.
Radioligand Binding
pH
7.4±n/a
Ki
0.5±n/a nM
Comments
extracted
Citation
 Galley, GGhellamallah, CNorcross, RPflieger, P Pyrazole derivatives US Patent  US9073911 Publication Date 7/7/2015 
Target
Name:
Trace amine-associated receptor 1
Synonyms:
TAAR1_MOUSE Taar1 Trace amine receptor 1 (TARR1) Trace amine-associated receptor1 | Trar1
Type:
Protein
Mol. Mass.:
37635.41
Organism:
Mus musculus (Mouse)
Description:
Q923Y8
Residue:
332
  
Inhibitor
Name:
BDBM167461
Synonyms:
US9073911, 10
Type:
Small organic molecule
Emp. Form.:
C20H19ClN4O2
Mol. Mass.:
382.843
SMILES:
Clc1ccccc1-c1cc([nH]n1)C(=O)Nc1ccc(cc1)[C@H]1CNCCO1
: