Target
Trace amine-associated receptor 1
Ligand
BDBM167461
Substrate
Meas. Tech.
Radioligand Binding
pH
7.4±n/a
Ki
2.6±n/a nM
Comments
extracted
Citation
 Galley, GGhellamallah, CNorcross, RPflieger, P Pyrazole derivatives US Patent  US9073911 Publication Date 7/7/2015 
Target
Name:
Trace amine-associated receptor 1
Synonyms:
TAAR1_RAT Taar1 Trace amine receptor 1 (TARR1) Trace amine-associated receptor 1 (TAAR1) Trar1
Type:
Enzyme
Mol. Mass.:
38034.73
Organism:
Rattus norvegicus (Rat)
Description:
Q923Y9
Residue:
332
  
Inhibitor
Name:
BDBM167461
Synonyms:
US9073911, 10
Type:
Small organic molecule
Emp. Form.:
C20H19ClN4O2
Mol. Mass.:
382.843
SMILES:
Clc1ccccc1-c1cc([nH]n1)C(=O)Nc1ccc(cc1)[C@H]1CNCCO1
: