Target
Aurora kinase B/Inner centromere protein
Ligand
BDBM167515
Substrate
Meas. Tech.
Radioactive Assay
IC50
3±n/a nM
Citation
 Carry, JCheve, MClerc, FCombeau, CGontier, SKrick, ALachaud, SSchio, L Anti-cancer compound and pharmaceutical composition containing the same US Patent  US9073917 Publication Date 7/7/2015 
Target
Name:
Aurora kinase B/Inner centromere protein
Synonyms:
Aurora B/Incenp
Type:
Protein Complex
Mol. Mass.:
Description:
Components:
This complex has 2 components.
Component 1
Name:
Aurora kinase B
Synonyms:
AIK2 AIM1 ARK2 AURKB_HUMAN Aurora B-INCENP Aurora kinase B (AURKB) STK-1 STK12 Serine/threonine-protein kinase aurora B
Type:
Protein
Mol. Mass.:
39327.72
Organism:
Homo sapiens (Human)
Description:
Q96GD4
Residue:
344
  
Component 2
Name:
Inner centromere protein
Synonyms:
INCENP | INCE_HUMAN
Type:
Protein
Mol. Mass.:
105461.33
Organism:
Homo sapiens (Human)
Description:
Q9NQS7
Residue:
918
  
Inhibitor
Name:
BDBM167515
Synonyms:
US9073917, 12- comparative
Type:
Small organic molecule
Emp. Form.:
C25H22N4O4S
Mol. Mass.:
474.532
SMILES:
CCOC(=O)c1[nH]cc2[C@@H](c3ccc(Sc4nc5ccccc5[nH]4)o3)C3=C(CCCC3=O)Nc12
: