Target
Sodium channel protein type 9 subunit alpha
Ligand
BDBM170216
Substrate
Meas. Tech.
In Vitro Assay
IC50
4200±n/a nM
Citation
 Dineen, TMarx, IENguyen, HNWeiss, M Heteroaryl sodium channel inhibitors US Patent  US9079902 Publication Date 7/14/2015 
Target
Name:
Sodium channel protein type 9 subunit alpha
Synonyms:
NENA Peripheral sodium channel 1 SCN9A_HUMAN Voltage-gated sodium channel subunit Nav1.7 hNE-Na
Type:
Protein
Mol. Mass.:
226375.97
Organism:
Homo sapiens (Human)
Description:
Q15858
Residue:
1988
  
Inhibitor
Name:
BDBM170216
Synonyms:
US9079902, 47
Type:
Small organic molecule
Emp. Form.:
C19H19N5O2S2
Mol. Mass.:
413.516
SMILES:
CN(C)c1cccc(c1)-c1cn(C)c2cc(ccc12)S(=O)(=O)Nc1ncns1
: