Target
Sodium channel protein type 5 subunit alpha
Ligand
BDBM170216
Substrate
Meas. Tech.
In Vitro Assay
IC50
>10000±n/a nM
Citation
 Dineen, TMarx, IENguyen, HNWeiss, M Heteroaryl sodium channel inhibitors US Patent  US9079902 Publication Date 7/14/2015 
Target
Name:
Sodium channel protein type 5 subunit alpha
Synonyms:
HH1 SCN5A_HUMAN Sodium channel protein type 5 subunit alpha/beta-1/beta-2 Voltage-gated sodium channel subunit alpha Nav1.5
Type:
Enzyme
Mol. Mass.:
226908.60
Organism:
Homo sapiens (Human)
Description:
Q14524
Residue:
2016
  
Inhibitor
Name:
BDBM170216
Synonyms:
US9079902, 47
Type:
Small organic molecule
Emp. Form.:
C19H19N5O2S2
Mol. Mass.:
413.516
SMILES:
CN(C)c1cccc(c1)-c1cn(C)c2cc(ccc12)S(=O)(=O)Nc1ncns1
: