Target
Complement factor D
Ligand
BDBM170760
Substrate
Meas. Tech.
In Vitro Assay
pH
7.5±n/a
Temperature
298.15±n/a K
IC50
1067±n/a nM
Comments
extracted
Citation
 Altmann, EHommel, ULorthiois, ELMaibaum, JKOstermann, NQuancard, JRandl, SARogel, OSimic, OVulpetti, A Complement pathway modulators and uses thereof US Patent  US9085555 Publication Date 7/21/2015 
Target
Name:
Complement factor D
Synonyms:
Adipsin CFAD_HUMAN DF Properdin factor D
Type:
Protein
Mol. Mass.:
27039.19
Organism:
Homo sapiens (Human)
Description:
P00746
Residue:
253
  
Inhibitor
Name:
BDBM170760
Synonyms:
US9085555, 188
Type:
Small organic molecule
Emp. Form.:
C23H18F4N6O4
Mol. Mass.:
518.4204
SMILES:
NC(=O)n1cc(NC(=O)N2C[C@H](C[C@H]2C(=O)Nc2cccc(OC(F)(F)F)c2F)C#N)c2ccccc12
: