Target
Complement factor D
Ligand
BDBM170971
Substrate
Meas. Tech.
In Vitro Assay
pH
7.5±n/a
Temperature
298.15±n/a K
IC50
1050±n/a nM
Comments
extracted
Citation
 Altmann, EHommel, ULorthiois, ELMaibaum, JKOstermann, NQuancard, JRandl, SARogel, OSimic, OVulpetti, A Complement pathway modulators and uses thereof US Patent  US9085555 Publication Date 7/21/2015 
Target
Name:
Complement factor D
Synonyms:
Adipsin CFAD_HUMAN DF Properdin factor D
Type:
Protein
Mol. Mass.:
27039.19
Organism:
Homo sapiens (Human)
Description:
P00746
Residue:
253
  
Inhibitor
Name:
BDBM170971
Synonyms:
US9085555, 401
Type:
Small organic molecule
Emp. Form.:
C28H27FN6O3
Mol. Mass.:
514.5508
SMILES:
NCc1ccc(c(F)c1)-c1cccc(NC(=O)[C@@H]2CCCN2C(=O)Nc2cn(C(N)=O)c3ccccc23)c1
: