Target
Nitric oxide synthase, inducible
Ligand
BDBM50255310
Substrate
Meas. Tech.
Enzyme Inhibition Assay
Ki
13600±n/a nM
Citation
 Silverman, RBMeyskens, FLYang, SJi, HXue, FPoulos, TL Specific nNOS inhibitors for the therapy and prevention of human melanoma US Patent  US9090589 Publication Date 7/28/2015 
Target
Name:
Nitric oxide synthase, inducible
Synonyms:
HEP-NOS Inducible NO synthase NOS type II NOS2A Nitric oxide synthase, inducible (iNOS) | iNOS
Type:
Homodimer
Mol. Mass.:
131141.95
Organism:
Homo sapiens (Human)
Description:
P35228
Residue:
1153
  
Inhibitor
Name:
BDBM50255310
Synonyms:
CHEMBL479280 US9090589, 3
Type:
Small organic molecule
Emp. Form.:
C21H28F3N5
Mol. Mass.:
407.4757
SMILES:
Cc1cc(N)nc(C[C@H]2CNC[C@H]2NCCNCc2cccc(c2)C(F)(F)F)c1
: