Target
Casein kinase I isoform delta
Ligand
BDBM173195
Substrate
Meas. Tech.
HTS Assay
Temperature
298.15±n/a K
IC50
21400±n/a nM
Comments
extracted
Citation
 Wagner, FFPan, JQDandapani, SGermain, AHolson, EMunoz, BNag, PPWeiwer, MLewis, MCHaggarty, SJBishop, JAStegmaier, KBanerji, V Kinase inhibitors and methods of use thereof US Patent  US9096594 Publication Date 8/4/2015 
Target
Name:
Casein kinase I isoform delta
Synonyms:
CKI-delta CSNK1D Casein kinase I delta Casein kinase I isoform delta (CK1D) KC1D_HUMAN | casein kinases 1 delta (CK1 delta)
Type:
Enzyme
Mol. Mass.:
47356.76
Organism:
Homo sapiens (Human)
Description:
P48730
Residue:
415
  
Inhibitor
Name:
BDBM173195
Synonyms:
US10137122, Compound 3 | US9096594, 3
Type:
Small organic molecule
Emp. Form.:
C19H21N3O
Mol. Mass.:
307.3895
SMILES:
Cc1[nH]nc2NC3=C([C@H](c12)c1ccccc1)C(=O)CC(C)(C)C3
: