Target
Disintegrin and metalloproteinase domain-containing protein 17
Ligand
BDBM175083
Substrate
Meas. Tech.
Enzyme Assay
pH
7.4±n/a
IC50
35±n/a nM
Comments
extracted
Citation
 Chambon, SClary, LSchuppli, M N-[2-hydroxycarbamoyl-2-(piperazinyl) ethyl] benzamide compounds, their preparation and their use as TACE inhibitors US Patent  US9115102 Publication Date 8/25/2015 
Target
Name:
Disintegrin and metalloproteinase domain-containing protein 17
Synonyms:
ADA17_HUMAN CSVP Disintegrin and metalloproteinase domain-containing protein 17 (ADAM17) TNF-alpha convertase TNF-alpha-converting enzyme (TACE) Tumor necrosis factor-α converting enzyme (TACE)
Type:
Enzyme
Mol. Mass.:
93007.89
Organism:
Homo sapiens (Human)
Description:
Residue:
824
  
Inhibitor
Name:
BDBM175083
Synonyms:
US9115102, Ex14 | US9115102, Ex24
Type:
Small organic molecule
Emp. Form.:
C26H31N5O6S
Mol. Mass.:
541.619
SMILES:
Cc1cc(COc2ccc(cc2)C(=O)NC[C@H](N2CCN(CC2)S(C)(=O)=O)C(=O)NO)c2ccccc2n1
: