Target
Stromelysin-1
Ligand
BDBM175083
Substrate
Meas. Tech.
Enzyme Assay
IC50
6827±n/a nM
Citation
 Chambon, SClary, LSchuppli, M N-[2-hydroxycarbamoyl-2-(piperazinyl) ethyl] benzamide compounds, their preparation and their use as TACE inhibitors US Patent  US9115102 Publication Date 8/25/2015 
Target
Name:
Stromelysin-1
Synonyms:
MMP-3 MMP3_HUMAN Matrix metalloproteinase 3 Matrix metalloproteinase-3 (MMP-3) SL-1 Stromelysin 1 | Transin-1
Type:
Enzyme
Mol. Mass.:
53973.13
Organism:
Homo sapiens (Human)
Description:
P08254
Residue:
477
  
Inhibitor
Name:
BDBM175083
Synonyms:
US9115102, Ex14 | US9115102, Ex24
Type:
Small organic molecule
Emp. Form.:
C26H31N5O6S
Mol. Mass.:
541.619
SMILES:
Cc1cc(COc2ccc(cc2)C(=O)NC[C@H](N2CCN(CC2)S(C)(=O)=O)C(=O)NO)c2ccccc2n1
: