Target
Reverse transcriptase protein
Ligand
BDBM175335
Substrate
Meas. Tech.
In-vitro HIV-1 RT Screening
IC50
8.360e+4±n/a nM
Citation
 Chander, SAshok, PZheng, YTWang, PRaja, KSTaneja, AMurugesan, S Design, synthesis and in-vitro evaluation of novel tetrahydroquinoline carbamates as HIV-1 RT inhibitor and their antifungal activity. Bioorg Chem 64:66-73 (2016)  
Target
Name:
Reverse transcriptase protein
Synonyms:
Gag-Pol polyprotein Reverse Transcriptase (HIV-1 RT) | Reverse transcriptase (HIV1-RT)
Type:
Protein
Mol. Mass.:
30197.77
Organism:
Human immunodeficiency virus type 1 group M subtype B (isolate HXB2) (HIV-1)
Description:
Q9WJQ1
Residue:
259
  
Inhibitor
Name:
BDBM175335
Synonyms:
1-(4-chlorophenyl)-2-(3,4-dihydroquinolin-1(2H)-yl)ethyl p-tolylcarbamate (6d)
Type:
Small organic molecule
Emp. Form.:
C25H25ClN2O2
Mol. Mass.:
420.931
SMILES:
Cc1ccc(NC(=O)OC(CN2CCCc3ccccc23)c2ccc(Cl)cc2)cc1
: