Target
Aquaporin-1
Ligand
BDBM50089038
Substrate
Meas. Tech.
Stopped-flow Assay
IC50
2.7e+3± 6e+2 nM
Citation
 Patil, RVXu, Svan Hoek, ANRusinko, AFeng, ZMay, JHellberg, MSharif, NAWax, MBIrigoyen, MCarr, GBrittain, TBrown, PColbert, DKumari, SVaradaraj, KMitra, AK Rapid Identification of Novel Inhibitors of the Human Aquaporin-1 Water Channel. Chem Biol Drug Des 87:794-805 (2016)  
Target
Name:
Aquaporin-1
Synonyms:
AQP1 Aquaporin-1 (AQP1) | CHIP28
Type:
Protein
Mol. Mass.:
28528.18
Organism:
Homo sapiens (Human)
Description:
Residue:
269
  
Inhibitor
Name:
BDBM50089038
Synonyms:
CGP 71683 CHEMBL17645 Naphthalene-1-sulfonic acid {4-[(4-amino-quinazolin-2-ylamino)-methyl]-cyclohexylmethyl}-amide
Type:
Small organic molecule
Emp. Form.:
C26H29N5O2S
Mol. Mass.:
475.606
SMILES:
Nc1nc(NC[C@H]2CC[C@H](CNS(=O)(=O)c3cccc4ccccc34)CC2)nc2ccccc12
: