Target
Aquaporin-1
Ligand
BDBM50354083
Substrate
Meas. Tech.
Stopped-flow Assay
IC50
3.9e+3± 4e+2 nM
Citation
 Patil, RVXu, Svan Hoek, ANRusinko, AFeng, ZMay, JHellberg, MSharif, NAWax, MBIrigoyen, MCarr, GBrittain, TBrown, PColbert, DKumari, SVaradaraj, KMitra, AK Rapid Identification of Novel Inhibitors of the Human Aquaporin-1 Water Channel. Chem Biol Drug Des 87:794-805 (2016)  
Target
Name:
Aquaporin-1
Synonyms:
AQP1 Aquaporin-1 (AQP1) | CHIP28
Type:
Protein
Mol. Mass.:
28528.18
Organism:
Homo sapiens (Human)
Description:
Residue:
269
  
Inhibitor
Name:
BDBM50354083
Synonyms:
CHEMBL1836102 | N-{[(1r,4r)-4-{[(4-aminoquinazolin-2-yl)amino]methyl}cyclohexyl]methyl}naphthalene-2-sulfonamide (Compound 2)
Type:
Small organic molecule
Emp. Form.:
C26H29N5O2S
Mol. Mass.:
475.606
SMILES:
Nc1nc(NC[C@H]2CC[C@H](CNS(=O)(=O)c3ccc4ccccc4c3)CC2)nc2ccccc12
: