Target
Aquaporin-1
Ligand
BDBM178094
Substrate
Meas. Tech.
Stopped-flow Assay
IC50
2.94e+4± 8e+2 nM
Citation
 Patil, RVXu, Svan Hoek, ANRusinko, AFeng, ZMay, JHellberg, MSharif, NAWax, MBIrigoyen, MCarr, GBrittain, TBrown, PColbert, DKumari, SVaradaraj, KMitra, AK Rapid Identification of Novel Inhibitors of the Human Aquaporin-1 Water Channel. Chem Biol Drug Des 87:794-805 (2016)  
Target
Name:
Aquaporin-1
Synonyms:
AQP1 Aquaporin-1 (AQP1) | CHIP28
Type:
Protein
Mol. Mass.:
28528.18
Organism:
Homo sapiens (Human)
Description:
Residue:
269
  
Inhibitor
Name:
BDBM178094
Synonyms:
{[7-(2,6-dichlorophenyl)-5-fluoro-2,3-dihydro-1-benzofuran-2-yl]methyl}(methyl)amine (Compound 6)
Type:
Small organic molecule
Emp. Form.:
C16H14Cl2FNO
Mol. Mass.:
326.193
SMILES:
CNCC1Cc2cc(F)cc(c2O1)-c1c(Cl)cccc1Cl
: