Target
Apoptosis regulator Bcl-2
Ligand
BDBM178659
Substrate
Meas. Tech.
Time Resolved-Fluorescence Resonance Energy Transfer (TR-FRET) Assay
Ki
0.01±n/a nM
Citation
 Bruncko, MDing, HDoherty, GAElmore, SWHasvold, LHexamer, LAKunzer, ARMantei, RAMcClellan, WJPark, CHPark, CPetros, AMSong, XSouers, AJSullivan, GMTao, ZWang, GTWang, LWang, XWendt, MD Bcl-2-selective apoptosis-inducing agents for the treatment of cancer and immune diseases US Patent  US9125913 Publication Date 9/8/2015 
Target
Name:
Apoptosis regulator Bcl-2
Synonyms:
BCL2_MOUSE Bcl2
Type:
Protein
Mol. Mass.:
26409.44
Organism:
Mus musculus (Mouse)
Description:
P10417
Residue:
236
  
Inhibitor
Name:
BDBM178659
Synonyms:
US9125913, 225
Type:
Small organic molecule
Emp. Form.:
C48H54ClN7O8S
Mol. Mass.:
924.502
SMILES:
OC1CCC(=C(CN2CCN(CC2)c2ccc(C(=O)NS(=O)(=O)c3ccc(NC4CCN(CC4)C4CCOCC4)c(c3)[N+]([O-])=O)c(Oc3ccc4[nH]ccc4c3)c2)C1)c1ccc(Cl)cc1
: