Target
Apoptosis regulator Bcl-2
Ligand
BDBM178868
Substrate
Meas. Tech.
Time Resolved-Fluorescence Resonance Energy Transfer (TR-FRET) Assay
Ki
<0.010±n/a nM
Citation
 Bruncko, MDing, HDoherty, GAElmore, SWHasvold, LHexamer, LAKunzer, ARMantei, RAMcClellan, WJPark, CHPark, CPetros, AMSong, XSouers, AJSullivan, GMTao, ZWang, GTWang, LWang, XWendt, MD Bcl-2-selective apoptosis-inducing agents for the treatment of cancer and immune diseases US Patent  US9125913 Publication Date 9/8/2015 
Target
Name:
Apoptosis regulator Bcl-2
Synonyms:
BCL2_MOUSE Bcl2
Type:
Protein
Mol. Mass.:
26409.44
Organism:
Mus musculus (Mouse)
Description:
P10417
Residue:
236
  
Inhibitor
Name:
BDBM178868
Synonyms:
US9125913, 440
Type:
Small organic molecule
Emp. Form.:
C47H54ClN7O7S
Mol. Mass.:
896.492
SMILES:
COC1CCC(CNc2ccc(cc2[N+]([O-])=O)S(=O)(=O)NC(=O)c2ccc(cc2Oc2cccc3[nH]cnc23)N2CCN(CC3=C(CC(C)(C)CC3)c3ccc(Cl)cc3)CC2)CC1
: