Target
ALK tyrosine kinase receptor
Ligand
BDBM179297
Substrate
Meas. Tech.
Kinase Assay
Temperature
305.15±n/a K
IC50
<1±0 nM
Comments
extracted
Citation
 Liang, C Substituted pyridazine carboxamide compounds US Patent  US9126947 Publication Date 9/8/2015 
Target
Name:
ALK tyrosine kinase receptor
Synonyms:
ALK ALK_HUMAN CD_antigen: CD246
Type:
Protein
Mol. Mass.:
176453.10
Organism:
Homo sapiens (Human)
Description:
Q9UM73
Residue:
1620
  
Inhibitor
Name:
BDBM179297
Synonyms:
US9126947, 18
Type:
Small organic molecule
Emp. Form.:
C26H27Cl2FN6O3
Mol. Mass.:
561.435
SMILES:
C[C@@H](Oc1cc(nnc1N)C(=O)Nc1ccc(cc1)C(=O)N1C[C@H](C)N[C@H](C)C1)c1c(Cl)ccc(F)c1Cl
: