Target
Vascular endothelial growth factor receptor 2
Ligand
BDBM180271
Substrate
Meas. Tech.
Kinase Assay
pH
7±n/a
Temperature
298.15±n/a K
IC50
23±n/a nM
Comments
extracted
Citation
 Xi, N Substituted quinoline compounds and methods of use US Patent  US9133162 Publication Date 9/15/2015 
Target
Name:
Vascular endothelial growth factor receptor 2
Synonyms:
CD_antigen=CD309 Fetal liver kinase 1 (FLK-1) KDR Protein-tyrosine kinase receptor Flk-1 VEGFR-2 VEGFR2 Vascular Endothelial Growth Factor Receptor Kinase 2 Vascular endothelial growth factor receptor 2 (KDR) Vascular endothelial growth factor receptor 2 (VEGFR2) Vascular endothelial growth factor receptor-2 (VEGFR-2)
Type:
Receptor Tyrosine Kinase
Mol. Mass.:
151510.97
Organism:
Homo sapiens (Human)
Description:
P35968
Residue:
1356
  
Inhibitor
Name:
BDBM180271
Synonyms:
US9133162, Example 2
Type:
Small organic molecule
Emp. Form.:
C30H27FN4O5
Mol. Mass.:
542.5576
SMILES:
C[C@@H](O)COc1ccc2c(Oc3ccc(NC(=O)c4c(C)n(C)n(-c5ccccc5)c4=O)cc3F)ccnc2c1
: