Target
D(3) dopamine receptor
Ligand
BDBM180720
Substrate
Meas. Tech.
Radioligand Binding Assay
Ki
5.189±n/a nM
Citation
 Gobbi, LJaeschke, GRoche, OSarmiento, RMSteward, L Dual modulators of 5HT2A and D3 receptors US Patent  US8829029 Publication Date 9/9/2014 
Target
Name:
D(3) dopamine receptor
Synonyms:
DOPAMINE D3 DRD3_HUMAN Dopamine D3 receptor (D3) Dopamine receptor Dopamine receptor D3
Type:
Mol. Mass.:
44243.43
Organism:
Homo sapiens (Human)
Description:
Residue:
400
  
Inhibitor
Name:
BDBM180720
Synonyms:
US8829029, 20
Type:
Small organic molecule
Emp. Form.:
C23H29F4N3O2
Mol. Mass.:
455.4889
SMILES:
Fc1ccc2c(noc2c1)C1CCN(CC[C@H]2CC[C@@H](CC2)NC(=O)CC(F)(F)F)CC1
: