Target
o-succinylbenzoate synthase
Ligand
BDBM181039
Substrate
Meas. Tech.
MenE-MenB Coupled Assay
pH
7.4±n/a
IC50
>1.00e+5±n/a nM
Comments
extracted
Citation
 Matarlo, JSEvans, CESharma, ILavaud, LJNgo, SCShek, RRajashankar, KRFrench, JBTan, DSTonge, PJ Mechanism of MenE inhibition by acyl-adenylate analogues and discovery of novel antibacterial agents. Biochemistry 54:6514-24 (2015)  
Target
Name:
o-succinylbenzoate synthase
Synonyms:
MENC_ECOLI o-Succinylbenzoyl-CoA synthase (MenE)
Type:
Protein
Mol. Mass.:
35465.11
Organism:
Escherichia coli K-12 (Enterobacteria)
Description:
Residue:
320
  
Inhibitor
Name:
BDBM181039
Synonyms:
5'-O-(N-[4''-(3-carboxylphenyl)-4''-oxobutanoyl]sulfamoyl)adenosine (2, MSB-AMS)
Type:
Small organic molecule
Emp. Form.:
C21H21N6O10S
Mol. Mass.:
549.491
SMILES:
Nc1ncnc2n(cnc12)[C@@H]1O[C@H](COS(=O)(=O)NC(=O)CCC(=O)c2cccc(c2)C([O-])=O)[C@@H](O)[C@H]1O
: