Target
o-succinylbenzoate synthase
Ligand
BDBM181047
Substrate
Meas. Tech.
MenE-MenB Coupled Assay
pH
7.4±n/a
IC50
>1.00e+5±n/a nM
Comments
extracted
Citation
 Matarlo, JSEvans, CESharma, ILavaud, LJNgo, SCShek, RRajashankar, KRFrench, JBTan, DSTonge, PJ Mechanism of MenE inhibition by acyl-adenylate analogues and discovery of novel antibacterial agents. Biochemistry 54:6514-24 (2015)  
Target
Name:
o-succinylbenzoate synthase
Synonyms:
MENC_ECOLI o-Succinylbenzoyl-CoA synthase (MenE)
Type:
Protein
Mol. Mass.:
35465.11
Organism:
Escherichia coli K-12 (Enterobacteria)
Description:
Residue:
320
  
Inhibitor
Name:
BDBM181047
Synonyms:
5'-O-(N-[3-(1-Hydroxy-3-oxoisoindolin-1-yl)propanoyl]sulfamoyl)adenosine (10, Lactam)
Type:
Small organic molecule
Emp. Form.:
C21H23N7O9S
Mol. Mass.:
549.514
SMILES:
Nc1ncnc2n(cnc12)[C@@H]1O[C@H](COS(=O)(=O)NC(=O)CCC2(O)NC(=O)c3ccccc23)[C@@H](O)[C@H]1O
: