Target
Cytochrome P450 3A4
Ligand
BDBM18121
Substrate
Meas. Tech.
IC50
>10000±n/a nM
Citation
 Bareja, SPJones, SDOblong, JEMills, KJBierman, JC Cosmetic compositions containing substituted azole and methods for improving the appearance of aging skin US Patent  US9138393 Publication Date 9/22/2015 
Target
Name:
Cytochrome P450 3A4
Synonyms:
Albendazole monooxygenase CP3A4_HUMAN CYP3A4 CYPIIIA4 Cytochrome P450 3A4 (CYP3A4) Nifedipine oxidase Taurochenodeoxycholate 6-alpha-hydroxylase
Type:
Enzyme
Mol. Mass.:
57349.57
Organism:
Homo sapiens (Human)
Description:
Residue:
503
  
Inhibitor
Name:
BDBM18121
Synonyms:
(2S)-2-amino-4-carbamoylbutanoic acid Glutamine US9138393, L-Glutamine | US9144538, L-Glutamine
Type:
Amino Acid
Emp. Form.:
C5H10N2O3
Mol. Mass.:
146.1445
SMILES:
N[C@@H](CCC(N)=O)C(O)=O
: