Target
Tyrosine-protein kinase SYK
Ligand
BDBM182765
Substrate
Meas. Tech.
Syk Kinase Inhibition Assay
pH
7.5±n/a
Temperature
298.15±n/a K
IC50
0.49±n/a nM
Comments
extracted
Citation
 Sakamoto, TMita, TShibata, KOgino, YKomatani, H 1,2,4-triazine-6-carboxamide derivative US Patent  US9145414 Publication Date 9/29/2015 
Target
Name:
Tyrosine-protein kinase SYK
Synonyms:
KSYK_HUMAN Spleen Tyrosine Kinase Tyrosine-protein kinase SYK (Syk)
Type:
Enzyme
Mol. Mass.:
72079.99
Organism:
Homo sapiens (Human)
Description:
P43405
Residue:
635
  
Inhibitor
Name:
BDBM182765
Synonyms:
US9145414, 13
Type:
Small organic molecule
Emp. Form.:
C22H27N11O
Mol. Mass.:
461.5229
SMILES:
Cn1cc(cn1)-c1cc(Nc2nc(N[C@@H]3CCCC[C@@H]3N)nnc2C(N)=O)c2cnn(C)c2c1
: